Reaction Details
TargetMitochondrial peptide methionine sulfoxide reductase
LigandBDBM46667
Substrate/Competitorn/a
Meas. Tech.Absorbance-based biochemical high throughput dose response assay for activators of Methionine sulfoxide reductase A (MsrA)
EC50 79282±n/a nM
Citation PubChem, PC Absorbance-based biochemical high throughput dose response assay for activators of Methionine sulfoxide reductase A (MsrA) PubChem Bioassay(2012)[AID]
 
Mitochondrial peptide methionine sulfoxide reductase
Name:Mitochondrial peptide methionine sulfoxide reductase
Type:Enzyme Catalytic Domain
Mol. Mass.:25822.90
Organism:Bos taurus
Description:gi_73586699
Residue:233
BDBM46667
NameBDBM46667
Synonyms:2-phenyl-1,2-benzothiazol-3-one MLS-0107957.0001 cid_164981
TypeSmall organic molecule
Emp. Form.C13H9NOS
Mol. Mass.227.282
SMILESO=c1n(sc2ccccc12)-c1ccccc1