Reaction Details
TargetMultidrug efflux pump
LigandBDBM91520
Substrate/Competitorn/a
Meas. Tech.Dose Response HTS singleplex for inhibitors of yeast efflux pump, specifically Mdr1 with Cherry Pick2 compound set
EC50 9254±n/a nM
Citation PubChem, PC Dose Response HTS singleplex for inhibitors of yeast efflux pump, specifically Mdr1 with Cherry Pick2 compound set PubChem Bioassay(2012)[AID]
 
Multidrug efflux pump
Name:Multidrug efflux pump
Synonyms:Candida albicans strain ATCC 10261 multidrug efflux pump (MDR1) gene, MDR1-A allele, complete cds
Type:Enzyme Catalytic Domain
Mol. Mass.:62915.82
Organism:Candida albicans
Description:Q09GR2
Residue:564
BDBM91520
NameBDBM91520
TypeSmall organic molecule
Emp. Form.C29H23FN2O6
Mol. Mass.514.5011
SMILESFc1ccc2OC3(CCN(CC3)C(=O)c3ccc4OCOc4c3)C3(CC(=NO3)c3ccccc3)C(=O)c2c1