Reaction Details
TargetMultidrug efflux pump
LigandBDBM75438
Substrate/Competitorn/a
Meas. Tech.Dose Response HTS singleplex for inhibitors of yeast efflux pump, specifically Mdr1 with Cherry Pick2 compound set
EC50 32100±n/a nM
Citation PubChem, PC Dose Response HTS singleplex for inhibitors of yeast efflux pump, specifically Mdr1 with Cherry Pick2 compound set PubChem Bioassay(2012)[AID]
 
Multidrug efflux pump
Name:Multidrug efflux pump
Synonyms:Candida albicans strain ATCC 10261 multidrug efflux pump (MDR1) gene, MDR1-A allele, complete cds
Type:Enzyme Catalytic Domain
Mol. Mass.:62915.82
Organism:Candida albicans
Description:Q09GR2
Residue:564
BDBM75438
NameBDBM75438
TypeSmall organic molecule
Emp. Form.C26H27NO3S
Mol. Mass.433.562
SMILESCOc1cccc(c1)-c1sc2ccc(OC)cc2c1-c1ccc(OCCN(C)C)cc1