Reaction Details
TargetDNA dC->dU-editing enzyme APOBEC-3G
LigandBDBM91535
Substrate/Competitorn/a
Meas. Tech.SAR analysis of small molecule inhibitors of APOBEC3G DNA Deaminase via a fluorescence-based single-stranded DNA deaminase assay - Set 2
Temperature298.15±n/a K
IC50 1730±n/a nM
Commentsextracted
Citation PubChem, PC SAR analysis of small molecule inhibitors of APOBEC3G DNA Deaminase via a fluorescence-based single-stranded DNA deaminase assay - Set 2 PubChem Bioassay(2012)[AID]
 
DNA dC->dU-editing enzyme APOBEC-3G
Name:DNA dC->dU-editing enzyme APOBEC-3G
Type:Enzyme Catalytic Domain
Mol. Mass.:46419.54
Organism:Homo sapiens (Human)
Description:gi_13399304
Residue:384
BDBM91535
NameBDBM91535
Synonyms:2-pyrazolo[1,5-a]pyrimidinecarboxylic acid cid_670824 | pyrazolo[1,5-a]pyrimidine-2-carboxylic acid
TypeSmall organic molecule
Emp. Form.C7H5N3O2
Mol. Mass.163.1335
SMILESOC(=O)c1cc2ncccn2n1