Reaction Details
TargetKallikrein-5 [D153N]
LigandBDBM113060
Substrate/Competitorn/a
Meas. Tech.KLK5 Assay
pH8±n/a
Temperature310.15±n/a K
Ki 200±n/a nM
Commentsextracted
Citation Wagberg, FLeonardsson, G Benzoxazinone derivatives for treatment of skin diseases US Patent US9695194 Publication Date 7/4/2017
 
Kallikrein-5 [D153N]
Name:Kallikrein-5 [D153N]
Type:PROTEIN
Mol. Mass.:32031.75
Organism:Homo sapiens (Human)
Description:ChEMBL_1282456
Residue:293
BDBM113060
NameBDBM113060
Synonyms:US9695194, 1
TypeSmall organic molecule
Emp. Form.C18H17NO4S
Mol. Mass.343.397
SMILESCCOc1cc2c(cc1OC)nc(oc2=O)-c1ccccc1SC