Reaction Details
TargetKallikrein-14
LigandBDBM113060
Substrate/Competitorn/a
Meas. Tech.KLK14 Assay
pH8±n/a
Temperature310.15±n/a K
Ki 100±n/a nM
Commentsextracted
Citation Wagberg, FLeonardsson, G Benzoxazinone derivatives for treatment of skin diseases US Patent US9695194 Publication Date 7/4/2017
 
Kallikrein-14
Name:Kallikrein-14
Type:PROTEIN
Mol. Mass.:29136.99
Organism:Homo sapiens (Human)
Description:ChEMBL_1282452
Residue:267
BDBM113060
NameBDBM113060
Synonyms:US9695194, 1
TypeSmall organic molecule
Emp. Form.C18H17NO4S
Mol. Mass.343.397
SMILESCCOc1cc2c(cc1OC)nc(oc2=O)-c1ccccc1SC