Reaction Details
TargetSerine protease 1
LigandBDBM113067
Substrate/Competitorn/a
Meas. Tech.Trypsin Assay
pH7.2±n/a
Temperature310.15±n/a K
Ki>10000±n/a nM
Commentsextracted
Citation Wagberg, FLeonardsson, G Benzoxazinone derivatives for treatment of skin diseases US Patent US9695194 Publication Date 7/4/2017
 
Serine protease 1
Name:Serine protease 1
Type:Enzyme
Mol. Mass.:26557.80
Organism:Homo sapiens (Human)
Description:P07477
Residue:247
BDBM113067
NameBDBM113067
Synonyms:US9695194, 3
TypeSmall organic molecule
Emp. Form.C19H19NO6
Mol. Mass.357.3573
SMILESCCOc1cc2c(cc1OC)nc(oc2=O)-c1ccc(OC)cc1OC