Reaction Details
TargetKallikrein-7
LigandBDBM113068
Substrate/Competitorn/a
Meas. Tech.KLK7 Assay
pH7.2±n/a
Temperature310.15±n/a K
Ki 230±n/a nM
Commentsextracted
Citation Wagberg, FLeonardsson, G Benzoxazinone derivatives for treatment of skin diseases US Patent US9695194 Publication Date 7/4/2017
 
Kallikrein-7
Name:Kallikrein-7
Type:PROTEIN
Mol. Mass.:27535.05
Organism:Homo sapiens (Human)
Description:ChEMBL_1469257
Residue:253
BDBM113068
NameBDBM113068
Synonyms:US9695194, 4
TypeSmall organic molecule
Emp. Form.C18H17NO6S
Mol. Mass.375.396
SMILESCCOc1cc2c(cc1OC)nc(oc2=O)-c1ccccc1S(C)(=O)=O