Reaction Details
TargetCathepsin G
LigandBDBM113068
Substrate/Competitorn/a
Meas. Tech.Cathepsin G Assay
pH7.2±n/a
Temperature310.15±n/a K
Ki 2800±n/a nM
Commentsextracted
Citation Wagberg, FLeonardsson, G Benzoxazinone derivatives for treatment of skin diseases US Patent US9695194 Publication Date 7/4/2017
 
Cathepsin G
Name:Cathepsin G
Type:PROTEIN
Mol. Mass.:28860.08
Organism:Homo sapiens (Human)
Description:ChEMBL_1469016
Residue:255
BDBM113068
NameBDBM113068
Synonyms:US9695194, 4
TypeSmall organic molecule
Emp. Form.C18H17NO6S
Mol. Mass.375.396
SMILESCCOc1cc2c(cc1OC)nc(oc2=O)-c1ccccc1S(C)(=O)=O