Reaction Details
TargetCathepsin G
LigandBDBM113283
Substrate/Competitorn/a
Meas. Tech.Cathepsin G Assay
pH7.2±n/a
Temperature310.15±n/a K
Ki 600±n/a nM
Commentsextracted
Citation Wagberg, FLeonardsson, G Benzoxazinone derivatives for treatment of skin diseases US Patent US9695194 Publication Date 7/4/2017
 
Cathepsin G
Name:Cathepsin G
Type:PROTEIN
Mol. Mass.:28860.08
Organism:Homo sapiens (Human)
Description:ChEMBL_1469016
Residue:255
BDBM113283
NameBDBM113283
Synonyms:US9695194, 8
TypeSmall organic molecule
Emp. Form.C19H17NO6
Mol. Mass.355.3414
SMILESCOc1ccc(c(OC)c1)-c1nc2cc3OCCCOc3cc2c(=O)o1