Reaction Details
TargetProthrombin
LigandBDBM113283
Substrate/Competitorn/a
Meas. Tech.Thrombin Assay
pH8.3±n/a
Temperature310.15±n/a K
Ki>10000±n/a nM
Commentsextracted
Citation Wagberg, FLeonardsson, G Benzoxazinone derivatives for treatment of skin diseases US Patent US9695194 Publication Date 7/4/2017
 
Prothrombin
Name:Prothrombin
Type:Protein
Mol. Mass.:70029.57
Organism:Homo sapiens (Human)
Description:P00734
Residue:622
BDBM113283
NameBDBM113283
Synonyms:US9695194, 8
TypeSmall organic molecule
Emp. Form.C19H17NO6
Mol. Mass.355.3414
SMILESCOc1ccc(c(OC)c1)-c1nc2cc3OCCCOc3cc2c(=O)o1