Reaction Details
TargetCathepsin G
LigandBDBM113296
Substrate/Competitorn/a
Meas. Tech.Cathepsin G Assay
pH7.2±n/a
Temperature310.15±n/a K
Ki 700±n/a nM
Commentsextracted
Citation Wagberg, FLeonardsson, G Benzoxazinone derivatives for treatment of skin diseases US Patent US9695194 Publication Date 7/4/2017
 
Cathepsin G
Name:Cathepsin G
Type:PROTEIN
Mol. Mass.:28860.08
Organism:Homo sapiens (Human)
Description:ChEMBL_1469016
Residue:255
BDBM113296
NameBDBM113296
Synonyms:US9695194, 13
TypeSmall organic molecule
Emp. Form.C17H13NO5
Mol. Mass.311.2888
SMILESCOc1ccccc1-c1nc2cc3OCCOc3cc2c(=O)o1