Reaction Details
TargetProthrombin
LigandBDBM113297
Substrate/Competitorn/a
Meas. Tech.Thrombin Assay
pH8.3±n/a
Temperature310.15±n/a K
Ki 3000±n/a nM
Commentsextracted
Citation Wagberg, FLeonardsson, G Benzoxazinone derivatives for treatment of skin diseases US Patent US9695194 Publication Date 7/4/2017
 
Prothrombin
Name:Prothrombin
Type:Protein
Mol. Mass.:70029.57
Organism:Homo sapiens (Human)
Description:P00734
Residue:622
BDBM113297
NameBDBM113297
Synonyms:US9695194, 14
TypeSmall organic molecule
Emp. Form.C17H13NO6S
Mol. Mass.359.353
SMILESCS(=O)(=O)c1ccccc1-c1nc2cc3OCCOc3cc2c(=O)o1