Reaction Details
TargetChymotrypsin-C
LigandBDBM113300
Substrate/Competitorn/a
Meas. Tech.Chymotrypsin Assay
pH7.2±n/a
Temperature310.15±n/a K
Ki<100±n/a nM
Commentsextracted
Citation Wagberg, FLeonardsson, G Benzoxazinone derivatives for treatment of skin diseases US Patent US9695194 Publication Date 7/4/2017
 
Chymotrypsin-C
Name:Chymotrypsin-C
Type:Enzyme
Mol. Mass.:29487.98
Organism:Homo sapiens (Human)
Description:Q99895
Residue:268
BDBM113300
NameBDBM113300
Synonyms:US9695194, 16
TypeSmall organic molecule
Emp. Form.C16H10ClNO4
Mol. Mass.315.708
SMILESClc1ccccc1-c1nc2cc3OCCOc3cc2c(=O)o1