Reaction Details
TargetKallikrein-7
LigandBDBM113301
Substrate/Competitorn/a
Meas. Tech.KLK7 Assay
pH7.2±n/a
Temperature310.15±n/a K
Ki 175±n/a nM
Commentsextracted
Citation Wagberg, FLeonardsson, G Benzoxazinone derivatives for treatment of skin diseases US Patent US9695194 Publication Date 7/4/2017
 
Kallikrein-7
Name:Kallikrein-7
Type:PROTEIN
Mol. Mass.:27535.05
Organism:Homo sapiens (Human)
Description:ChEMBL_1469257
Residue:253
BDBM113301
NameBDBM113301
Synonyms:US9695194, 17
TypeSmall organic molecule
Emp. Form.C18H17NO6
Mol. Mass.343.3307
SMILESCOc1ccc(c(OC)c1)-c1nc2cc(OC)c(OC)cc2c(=O)o1