Reaction Details
TargetKallikrein-5 [D153N]
LigandBDBM50289001
Substrate/Competitorn/a
Meas. Tech.KLK5 Assay
pH8±n/a
Temperature310.15±n/a K
Ki 4500±n/a nM
Commentsextracted
Citation Wagberg, FLeonardsson, G Benzoxazinone derivatives for treatment of skin diseases US Patent US9695194 Publication Date 7/4/2017
 
Kallikrein-5 [D153N]
Name:Kallikrein-5 [D153N]
Type:PROTEIN
Mol. Mass.:32031.75
Organism:Homo sapiens (Human)
Description:ChEMBL_1282456
Residue:293
BDBM50289001
NameBDBM50289001
Synonyms:2-(2-Iodo-phenyl)-6,7-dimethoxy-benzo[d][1,3]oxazin-4-one US9695194, 18
TypeSmall organic molecule
Emp. Form.C16H12INO4
Mol. Mass.409.1753
SMILESCOc1cc2nc(oc(=O)c2cc1OC)-c1ccccc1I