Reaction Details
TargetTyrosine-protein phosphatase non-receptor type 22
LigandBDBM34462
Substrate/Competitorn/a
Meas. Tech.Dose Response selectivity of inhibitors of STriatal-Enriched Phosphatase (STEP) in the Lymphoid Phosphatase (PTPN22) Inhibition Assay
IC50>100000±0 nM
Citation PubChem, PC Dose Response selectivity of inhibitors of STriatal-Enriched Phosphatase (STEP) in the Lymphoid Phosphatase (PTPN22) Inhibition Assay PubChem Bioassay(2012)[AID]
 
Tyrosine-protein phosphatase non-receptor type 22
Name:Tyrosine-protein phosphatase non-receptor type 22
Type:n/a
Mol. Mass.:91712.31
Organism:Homo sapiens (Human)
Description:Q9Y2R2
Residue:807
BDBM34462
NameBDBM34462
Synonyms:(3,4-dichlorophenyl)-[4-(2-hydroxyethyl)-1-piperazinyl]methanethione (3,4-dichlorophenyl)-[4-(2-hydroxyethyl)piperazino]methanethione MLS000049575 cid_963027
TypeSmall organic molecule
Emp. Form.C13H16Cl2N2OS
Mol. Mass.319.25
SMILESOCCN1CCN(CC1)C(=S)c1ccc(Cl)c(Cl)c1