Reaction Details
TargetAcetylcholinesterase
LigandBDBM91582
Substrate/Competitorn/a
Meas. Tech.Enzyme Inhibition Assay
pH7.4±0
IC50 4.0e+2± 1.0e+2 nM
Citation Omran, ZStiebing, SGodard, AMSopkova-De Oliveira-Santos, JDallemagne, P Synthesis and biological evaluation of new donepezil-like Thiaindanones as AChE inhibitors. J Enzyme Inhib Med Chem23:696-703 (2008) 
 
Acetylcholinesterase
Name:Acetylcholinesterase
Type:n/a
Mol. Mass.:65900.74
Organism:Tetronarce californica (Pacific electric ray) (Torpedo californica)
Description:P04058
Residue:586
BDBM91582
NameBDBM91582
Synonyms:Thiaindanone, 11
TypeSmall organic molecule
Emp. Form.C20H22Br2FN3O2S
Mol. Mass.547.279
SMILESOC1CC(NC(=O)CN2CCN(Cc3ccccc3F)CC2)c2c(Br)sc(Br)c12