Reaction Details
TargetAcetylcholinesterase
LigandBDBM91585
Substrate/Competitorn/a
Meas. Tech.Enzyme Inhibition Assay
pH7.4±0
IC50 1.50e+3± 3.0e+2 nM
Citation Omran, ZStiebing, SGodard, AMSopkova-De Oliveira-Santos, JDallemagne, P Synthesis and biological evaluation of new donepezil-like Thiaindanones as AChE inhibitors. J Enzyme Inhib Med Chem23:696-703 (2008) 
 
Acetylcholinesterase
Name:Acetylcholinesterase
Type:n/a
Mol. Mass.:65900.74
Organism:Tetronarce californica (Pacific electric ray) (Torpedo californica)
Description:P04058
Residue:586
BDBM91585
NameBDBM91585
Synonyms:Thiaindanone, 14
TypeSmall organic molecule
Emp. Form.C20H22Br2FN5OS
Mol. Mass.559.293
SMILESNN=C1CC(NC(=O)CN2CCN(Cc3ccccc3F)CC2)c2c(Br)sc(Br)c12