Reaction Details
TargetAcetylcholinesterase
LigandBDBM91586
Substrate/Competitorn/a
Meas. Tech.Enzyme Inhibition Assay
pH7.4±0
IC50>5.00e+3±n/a nM
Citation Omran, ZStiebing, SGodard, AMSopkova-De Oliveira-Santos, JDallemagne, P Synthesis and biological evaluation of new donepezil-like Thiaindanones as AChE inhibitors. J Enzyme Inhib Med Chem23:696-703 (2008) 
 
Acetylcholinesterase
Name:Acetylcholinesterase
Type:n/a
Mol. Mass.:65900.74
Organism:Tetronarce californica (Pacific electric ray) (Torpedo californica)
Description:P04058
Residue:586
BDBM91586
NameBDBM91586
Synonyms:Thiaindanone, 15
TypeSmall organic molecule
Emp. Form.C23H22Br2FN3OS
Mol. Mass.567.312
SMILESFc1ccccc1CN1CCN(CC(=O)NC2C\C(=C/C#C)c3c(Br)sc(Br)c23)CC1