Reaction Details
TargetAcetylcholinesterase
LigandBDBM91590
Substrate/Competitorn/a
Meas. Tech.Enzyme Inhibition Assay
pH7.4±0
IC50>5.00e+3±n/a nM
Citation Omran, ZStiebing, SGodard, AMSopkova-De Oliveira-Santos, JDallemagne, P Synthesis and biological evaluation of new donepezil-like Thiaindanones as AChE inhibitors. J Enzyme Inhib Med Chem23:696-703 (2008) 
 
Acetylcholinesterase
Name:Acetylcholinesterase
Type:n/a
Mol. Mass.:65900.74
Organism:Tetronarce californica (Pacific electric ray) (Torpedo californica)
Description:P04058
Residue:586
BDBM91590
NameBDBM91590
Synonyms:Thiaindanone, 19
TypeSmall organic molecule
Emp. Form.C20H20Br2N2O2S
Mol. Mass.512.258
SMILESBrc1sc(Br)c2C(=O)CC(NC(=O)CCCN3CCc4ccccc4C3)c12