Reaction Details
TargetDeoxyuridine 5'-triphosphate nucleotidohydrolase
LigandBDBM50173567
Substrate/Competitorn/a
Meas. Tech.Inhibition Assay
pH8±0
Temperature298.15±0 K
Ki 6.28e+3±n/a nM
Citation Musso-Buendía, JAVidal, AEKasinthan, GNguyen, CCarrero-Lérida, JRuiz-Pérez, LMWilson, KJohansson, NGGilbert, IHGonzález-Pacanowska, D Kinetic properties and inhibition of the dimeric dUTPase-dUDPase from Campylobacter jejuni. J Enzyme Inhib Med Chem24:111-6 (2009) 
 
Deoxyuridine 5'-triphosphate nucleotidohydrolase
Name:Deoxyuridine 5'-triphosphate nucleotidohydrolase
Synonyms:dUTP pyrophosphatase
Type:Protein
Mol. Mass.:19574.43
Organism:Plasmodium falciparum
Description:Q8II92
Residue:173
BDBM50173567
NameBDBM50173567
TypeSmall organic molecule
Emp. Form.C15H25FN2O4Si
Mol. Mass.344.4539
SMILESCC(C)(C)[Si](C)(C)OCC1OC(CC1F)n1ccc(=O)[nH]c1=O