Reaction Details
TargetDeoxyuridine 5'-triphosphate nucleotidohydrolase
LigandBDBM50173530
Substrate/Competitorn/a
Meas. Tech.Inhibition Assay
pH8±0
Temperature298.15±0 K
Ki 4.2e+3±n/a nM
Citation Musso-Buendía, JAVidal, AEKasinthan, GNguyen, CCarrero-Lérida, JRuiz-Pérez, LMWilson, KJohansson, NGGilbert, IHGonzález-Pacanowska, D Kinetic properties and inhibition of the dimeric dUTPase-dUDPase from Campylobacter jejuni. J Enzyme Inhib Med Chem24:111-6 (2009) 
 
Deoxyuridine 5'-triphosphate nucleotidohydrolase
Name:Deoxyuridine 5'-triphosphate nucleotidohydrolase
Synonyms:dUTP pyrophosphatase
Type:Protein
Mol. Mass.:19574.43
Organism:Plasmodium falciparum
Description:Q8II92
Residue:173
BDBM50173530
NameBDBM50173530
TypeSmall organic molecule
Emp. Form.C25H30N2O5Si
Mol. Mass.466.6016
SMILESCC(C)(C)[Si](OCC1OC(CC1O)n1ccc(=O)[nH]c1=O)(c1ccccc1)c1ccccc1