Reaction Details
TargetNeuronal acetylcholine receptor subunit alpha-7
LigandBDBM50143314
Substrate/Competitorn/a
Meas. Tech. Creating an a7 Nicotinic Acetylcholine Recognition Domain from the Acetylcholine-binding Protein
pH7.4±n/a
Temperature293.15±n/a K
EC50 28±n/a nM
Citation Nemecz, AkosTaylor, Palmer  Creating an a7 Nicotinic Acetylcholine Recognition Domain from the Acetylcholine-binding Protein Taylor Research Group0:0 (2014)  
 
Neuronal acetylcholine receptor subunit alpha-7
Name:Neuronal acetylcholine receptor subunit alpha-7
Type:n/a
Mol. Mass.:56448.33
Organism:Homo sapiens (Human)
Description: CHRNA7 (NACHRA7)
Residue:502
BDBM50143314
NameBDBM50143314
Synonyms:(+)-Epibatidine (1R,2R,4S)-2-(6-Chloro-pyridin-3-yl)-7-aza-bicyclo[2.2.1]heptane CHEMBL298826 | EPIBATIDINE
TypeSmall organic molecule
Emp. Form.C11H13ClN2
Mol. Mass.208.687
SMILESClc1ccc(cn1)[C@H]1C[C@@H]2CC[C@H]1N2