Reaction Details
TargetCytochrome P450 26A1
LigandBDBM91700
Substrate/Competitorn/a
Meas. Tech.Cell Assay
EC50 2.0e+4±0 nM
Citation Pautus, SAboraia, ASBassett, CEBrancale, ACoogan, MPSimons, C Design and synthesis of substituted imidazole and triazole N-phenylbenzo[d]oxazolamine inhibitors of retinoic acid metabolizing enzyme CYP26. J Enzyme Inhib Med Chem24:487-98 (2009) 
 
Cytochrome P450 26A1
Name:Cytochrome P450 26A1
Type:Enzyme
Mol. Mass.:56216.16
Organism:Homo sapiens (Human)
Description:O43174
Residue:497
BDBM91700
NameBDBM91700
Synonyms:Oxazolamine derivative, 5c
TypeSmall organic molecule
Emp. Form.C25H20N4O3
Mol. Mass.424.4513
SMILESCOC(=O)c1ccc(cc1)C(c1ccc(Nc2nc3ccccc3o2)cc1)n1ccnc1