Reaction Details
TargetCytochrome P450 26A1
LigandBDBM50253810
Substrate/Competitorn/a
Meas. Tech.Cell Assay
EC50 5±0 nM
Citation Pautus, SAboraia, ASBassett, CEBrancale, ACoogan, MPSimons, C Design and synthesis of substituted imidazole and triazole N-phenylbenzo[d]oxazolamine inhibitors of retinoic acid metabolizing enzyme CYP26. J Enzyme Inhib Med Chem24:487-98 (2009) 
 
Cytochrome P450 26A1
Name:Cytochrome P450 26A1
Type:Enzyme
Mol. Mass.:56216.16
Organism:Homo sapiens (Human)
Description:O43174
Residue:497
BDBM50253810
NameBDBM50253810
Synonyms:CHEMBL459505 R-115866 US9963439, Talarozole
TypeSmall organic molecule
Emp. Form.C21H23N5S
Mol. Mass.377.506
SMILESCCC(CC)C(c1ccc(Nc2nc3ccccc3s2)cc1)n1cncn1