Reaction Details
TargetCytochrome P450 26A1
LigandBDBM91705
Substrate/Competitorn/a
Meas. Tech.Cell Assay
EC50>2.0e+4±0 nM
Citation Pautus, SAboraia, ASBassett, CEBrancale, ACoogan, MPSimons, C Design and synthesis of substituted imidazole and triazole N-phenylbenzo[d]oxazolamine inhibitors of retinoic acid metabolizing enzyme CYP26. J Enzyme Inhib Med Chem24:487-98 (2009) 
 
Cytochrome P450 26A1
Name:Cytochrome P450 26A1
Type:Enzyme
Mol. Mass.:56216.16
Organism:Homo sapiens (Human)
Description:O43174
Residue:497
BDBM91705
NameBDBM91705
Synonyms:1H-1,2,4-triazole, 12
TypeSmall organic molecule
Emp. Form.C22H17N5O
Mol. Mass.367.4033
SMILESN(c1nc2ccccc2o1)c1ccc(cc1)C(c1ccccc1)n1cnnc1