Reaction Details
TargetSoluble acetylcholine receptor
LigandBDBM91603
Substrate/Competitorn/a
Meas. Tech.Synthesizing Selective Agonists for the ?7 Nicotinic Receptor with in situ Click-Chemistry on Acetylcholine Binding Protein Templates.
pH7.4±n/a
Temperature293.15±n/a K
Ki 100±n/a nM
Citation Yamauchi, JGGomez, KGrimster, NDufouil, MNemecz, AFotsing, JRHo, KTalley, TTSharpless, KFokin, VVTaylor, P Synthesizing Selective Agonists for the ?7 Nicotinic Receptor with in situ Click-Chemistry on Acetylcholine Binding Protein Templates. Mol Pharmacol82:687-699 (2014) 
 
Soluble acetylcholine receptor
Name:Soluble acetylcholine receptor
Type:n/a
Mol. Mass.:26560.08
Organism:Aplysia Californica
Description:Q8WSF8
Residue:236
BDBM91603
NameBDBM91603
Synonyms:4' | alpha7 agonists 4'
Typen/a
Emp. Form.C22H30N5O
Mol. Mass.380.506
SMILESCN1CC=C(OCc2cnnn2C2CC3CCC(C2)[N+]3(C)C)c2ccccc12