Reaction Details
TargetAcetylcholine-binding protein
LigandBDBM91622
Substrate/Competitorn/a
Meas. Tech.Synthesizing Selective Agonists for the ?7 Nicotinic Receptor with in situ Click-Chemistry on Acetylcholine Binding Protein Templates.
pH7.4±n/a
Temperature293.15±n/a K
Ki 160±n/a nM
Citation Yamauchi, JGGomez, KGrimster, NDufouil, MNemecz, AFotsing, JRHo, KTalley, TTSharpless, KFokin, VVTaylor, P Synthesizing Selective Agonists for the ?7 Nicotinic Receptor with in situ Click-Chemistry on Acetylcholine Binding Protein Templates. Mol Pharmacol82:687-699 (2014) 
 
Acetylcholine-binding protein
Name:Acetylcholine-binding protein
Type:n/a
Mol. Mass.:26055.52
Organism:Lymnaea stagnalis
Description:Soluble acetylcholine receptor
Residue:229
BDBM91622
NameBDBM91622
Synonyms:22q | alpha7 agonists 22q
Typen/a
Emp. Form.C24H29N4O2
Mol. Mass.405.5121
SMILESCC(=O)c1c(OCc2cn(nn2)[C@H]2C[C@@H]3CC[C@H](C2)[N+]3(C)C)ccc2ccccc12