Reaction Details
TargetSoluble acetylcholine receptor
LigandBDBM91613
Substrate/Competitorn/a
Meas. Tech.Synthesizing Selective Agonists for the ?7 Nicotinic Receptor with in situ Click-Chemistry on Acetylcholine Binding Protein Templates.
pH7.4±n/a
Temperature293.15±n/a K
Ki 110±n/a nM
Citation Yamauchi, JGGomez, KGrimster, NDufouil, MNemecz, AFotsing, JRHo, KTalley, TTSharpless, KFokin, VVTaylor, P Synthesizing Selective Agonists for the ?7 Nicotinic Receptor with in situ Click-Chemistry on Acetylcholine Binding Protein Templates. Mol Pharmacol82:687-699 (2014) 
 
Soluble acetylcholine receptor
Name:Soluble acetylcholine receptor
Type:n/a
Mol. Mass.:26560.08
Organism:Aplysia Californica
Description:Q8WSF8
Residue:236
BDBM91613
NameBDBM91613
Synonyms:13q | alpha7 agonists 13q
Typen/a
Emp. Form.C20H27N4O3
Mol. Mass.371.4528
SMILESCOc1ccc(C=O)c(OCc2cn(nn2)[C@H]2C[C@@H]3CC[C@H](C2)[N+]3(C)C)c1