Reaction Details
TargetSoluble acetylcholine receptor
LigandBDBM91633
Substrate/Competitorn/a
Meas. Tech.Synthesizing Selective Agonists for the ?7 Nicotinic Receptor with in situ Click-Chemistry on Acetylcholine Binding Protein Templates.
pH7.4±n/a
Temperature293.15±n/a K
Ki 900±n/a nM
Citation Yamauchi, JGGomez, KGrimster, NDufouil, MNemecz, AFotsing, JRHo, KTalley, TTSharpless, KFokin, VVTaylor, P Synthesizing Selective Agonists for the ?7 Nicotinic Receptor with in situ Click-Chemistry on Acetylcholine Binding Protein Templates. Mol Pharmacol82:687-699 (2014) 
 
Soluble acetylcholine receptor
Name:Soluble acetylcholine receptor
Type:n/a
Mol. Mass.:26560.08
Organism:Aplysia Californica
Description:Q8WSF8
Residue:236
BDBM91633
NameBDBM91633
Synonyms:18t | alpha7 agonists 18t
Typen/a
Emp. Form.C22H30N4O
Mol. Mass.366.4998
SMILESCN1[C@H]2CC[C@@H]1C[C@H](C2)n1cc(COc2ccccc2C2CCCC2)nn1