Reaction Details
TargetCarbonic anhydrase 1
LigandBDBM91709
Substrate/Competitorn/a
Meas. Tech.Inhibition Assay
Ki 675±0.0 nM
Citation Morsy, SMBadawi, AMCecchi, AScozzafava, ASupuran, CT Carbonic anhydrase inhibitors. Biphenylsulfonamides with inhibitory action towards the transmembrane, tumor-associated isozymes IX possess cytotoxic activity against human colon, lung and breast cancer cell lines. J Enzyme Inhib Med Chem24:499-505 (2009) 
 
Carbonic anhydrase 1
Name:Carbonic anhydrase 1
Type:Enzyme
Mol. Mass.:28873.37
Organism:Homo sapiens (Human)
Description:P00915
Residue:261
BDBM91709
NameBDBM91709
Synonyms:Sulfonamide, 11
TypeSmall organic molecule
Emp. Form.C24H22N4O8S4
Mol. Mass.622.713
SMILESNS(=O)(=O)c1ccc(NS(=O)(=O)c2ccc(cc2)-c2ccc(cc2)S(=O)(=O)Nc2ccc(cc2)S(N)(=O)=O)cc1