Reaction Details
TargetCarbonic anhydrase 1
LigandBDBM91712
Substrate/Competitorn/a
Meas. Tech.Inhibition Assay
Ki 693±0.0 nM
Citation Morsy, SMBadawi, AMCecchi, AScozzafava, ASupuran, CT Carbonic anhydrase inhibitors. Biphenylsulfonamides with inhibitory action towards the transmembrane, tumor-associated isozymes IX possess cytotoxic activity against human colon, lung and breast cancer cell lines. J Enzyme Inhib Med Chem24:499-505 (2009) 
 
Carbonic anhydrase 1
Name:Carbonic anhydrase 1
Type:Enzyme
Mol. Mass.:28873.37
Organism:Homo sapiens (Human)
Description:P00915
Residue:261
BDBM91712
NameBDBM91712
Synonyms:Sulfonamide, 14
TypeSmall organic molecule
Emp. Form.C16H14N8O8S6
Mol. Mass.638.721
SMILESNS(=O)(=O)c1nnc(NS(=O)(=O)c2ccc(cc2)-c2ccc(cc2)S(=O)(=O)Nc2nnc(s2)S(N)(=O)=O)s1