Reaction Details
TargetCarbonic anhydrase 12
LigandBDBM10890
Substrate/Competitorn/a
Meas. Tech.Inhibition Assay
Ki 3.4±0.0 nM
Citation Morsy, SMBadawi, AMCecchi, AScozzafava, ASupuran, CT Carbonic anhydrase inhibitors. Biphenylsulfonamides with inhibitory action towards the transmembrane, tumor-associated isozymes IX possess cytotoxic activity against human colon, lung and breast cancer cell lines. J Enzyme Inhib Med Chem24:499-505 (2009) 
 
Carbonic anhydrase 12
Name:Carbonic anhydrase 12
Type:Enzyme
Mol. Mass.:39456.00
Organism:Homo sapiens (Human)
Description:Catalytic domain of human cloned isozyme was used in the assay
Residue:354
BDBM10890
NameBDBM10890
Synonyms:1-N-(3-chloro-1H-indol-7-yl)benzene-1,4-disulfonamide Compound 6 Indisulam (IND) | Sulfonamide, 7
TypeSmall organic molecule
Emp. Form.C14H12ClN3O4S2
Mol. Mass.385.846
SMILESNS(=O)(=O)c1ccc(cc1)S(=O)(=O)Nc1cccc2c(Cl)c[nH]c12