Reaction Details
TargetSerine/threonine-protein kinase Chk1
LigandBDBM91889
Substrate/Competitorn/a
Meas. Tech.ChemBL affinity - Published Abbott papers
Ki 501±n/a nM
Citation CSARdock, CD CHK1 in CSAR_FULL_RELEASE_3JULY2012 CSAR1:0 (2012)  
 
Serine/threonine-protein kinase Chk1
Name:Serine/threonine-protein kinase Chk1
Type:Enzyme Catalytic Domain
Mol. Mass.:54443.02
Organism:Homo sapiens (Human)
Description:gi_166295192
Residue:476
BDBM91889
NameBDBM91889
Synonyms:Chk1_24
Typen/a
Emp. Form.C28H29N3O
Mol. Mass.423.5494
SMILESCC1CCC(CC1)NCc1ccc-2c(Cc3c(n[nH]c-23)-c2ccc3cc(O)ccc3c2)c1