Reaction Details
TargetSerine/threonine-protein kinase Chk1
LigandBDBM91946
Substrate/Competitorn/a
Meas. Tech.Abbott Kinase Enzymatics_CHK1/289 CDC25c
IC50 59±n/a nM
Citation CSARdock, CD CHK1 in CSAR_FULL_RELEASE_3JULY2012 CSAR1:0 (2012)  
 
Serine/threonine-protein kinase Chk1
Name:Serine/threonine-protein kinase Chk1
Type:Enzyme Catalytic Domain
Mol. Mass.:54443.02
Organism:Homo sapiens (Human)
Description:gi_166295192
Residue:476
BDBM91946
NameBDBM91946
Synonyms:Chk1_78
Typen/a
Emp. Form.C30H31N3O3
Mol. Mass.481.5854
SMILESCOc1cc(ccc1O)-c1ccc(cc1)-c1n[nH]c-2c1Cc1cc(CNC3CCC(O)CC3)ccc-21