Reaction Details
TargetSerine/threonine-protein kinase Chk1
LigandBDBM14826
Substrate/Competitorn/a
Meas. Tech.Abbott Kinase Enzymatics_CHK1/289 CDC25c
IC50 3±n/a nM
Citation CSARdock, CD CHK1 in CSAR_FULL_RELEASE_3JULY2012 CSAR1:0 (2012)  
 
Serine/threonine-protein kinase Chk1
Name:Serine/threonine-protein kinase Chk1
Type:Enzyme Catalytic Domain
Mol. Mass.:54443.02
Organism:Homo sapiens (Human)
Description:gi_166295192
Residue:476
BDBM14826
NameBDBM14826
Synonyms:1-[5-chloro-2-(tetrahydrofuran-3-yloxy)phenyl]-3-(5-cyanopyrazin-2-yl)urea Chk1_12 | urea-based inhibitor 2a
TypeSmall organic molecule
Emp. Form.C16H14ClN5O3
Mol. Mass.359.767
SMILESClc1ccc(OC2CCOC2)c(NC(=O)Nc2cnc(cn2)C#N)c1