Reaction Details
TargetSerine/threonine-protein kinase Chk1
LigandBDBM91849
Substrate/Competitorn/a
Meas. Tech.ChemBL affinity - Published Abbott papers
Ki 10±n/a nM
Citation CSARdock, CD CHK1 in CSAR_FULL_RELEASE_3JULY2012 CSAR1:0 (2012)  
 
Serine/threonine-protein kinase Chk1
Name:Serine/threonine-protein kinase Chk1
Type:Enzyme Catalytic Domain
Mol. Mass.:54443.02
Organism:Homo sapiens (Human)
Description:gi_166295192
Residue:476
BDBM91849
NameBDBM91849
Synonyms:Chk1_125
Typen/a
Emp. Form.C21H18N4O3
Mol. Mass.374.3926
SMILESCOC(=O)Cc1ccc2Nc3cc(Nc4ccncc4)ccc3C(=O)Nc2c1