Reaction Details
TargetSerine/threonine-protein kinase Chk1
LigandBDBM91939
Substrate/Competitorn/a
Meas. Tech.ChemBL affinity - Published Abbott papers
Ki 79±n/a nM
Citation CSARdock, CD CHK1 in CSAR_FULL_RELEASE_3JULY2012 CSAR1:0 (2012)  
 
Serine/threonine-protein kinase Chk1
Name:Serine/threonine-protein kinase Chk1
Type:Enzyme Catalytic Domain
Mol. Mass.:54443.02
Organism:Homo sapiens (Human)
Description:gi_166295192
Residue:476
BDBM91939
NameBDBM91939
Synonyms:Chk1_70
Typen/a
Emp. Form.C21H16N2O4
Mol. Mass.360.3627
SMILESCOc1cc(ccc1C(O)=O)-c1ccc2c(Nc3ccccc3NC2=O)c1