Reaction Details
TargetSerine/threonine-protein kinase Chk1
LigandBDBM91953
Substrate/Competitorn/a
Meas. Tech.Abbott Kinase Enzymatics_CHK1/289 CDC25c
IC50 11±n/a nM
Citation CSARdock, CD CHK1 in CSAR_FULL_RELEASE_3JULY2012 CSAR1:0 (2012)  
 
Serine/threonine-protein kinase Chk1
Name:Serine/threonine-protein kinase Chk1
Type:Enzyme Catalytic Domain
Mol. Mass.:54443.02
Organism:Homo sapiens (Human)
Description:gi_166295192
Residue:476
BDBM91953
NameBDBM91953
Synonyms:Chk1_85
Typen/a
Emp. Form.C18H18ClN5O4
Mol. Mass.403.82
SMILESOC1CCCC(Oc2ccc(Cl)cc2NC(=O)Nc2cnc(cn2)C#N)C1O