Reaction Details
TargetSerine/threonine-protein kinase Chk1
LigandBDBM91930
Substrate/Competitorn/a
Meas. Tech.ChemBL affinity - Published Abbott papers
Ki 398±n/a nM
Citation CSARdock, CD CHK1 in CSAR_FULL_RELEASE_3JULY2012 CSAR1:0 (2012)  
 
Serine/threonine-protein kinase Chk1
Name:Serine/threonine-protein kinase Chk1
Type:Enzyme Catalytic Domain
Mol. Mass.:54443.02
Organism:Homo sapiens (Human)
Description:gi_166295192
Residue:476
BDBM91930
NameBDBM91930
Synonyms:Chk1_62
Typen/a
Emp. Form.C23H25N3O4
Mol. Mass.407.4623
SMILESCOC(=O)c1ccc(o1)-c1n[nH]c-2c1Cc1cc(CNC3CCC(O)CC3)ccc-21