Reaction Details
TargetSerine/threonine-protein kinase Chk1
LigandBDBM50221567
Substrate/Competitorn/a
Meas. Tech.ChemBL affinity - Published Abbott papers
IC50 0.5±n/a nM
Citation CSARdock, CD CHK1 in CSAR_FULL_RELEASE_3JULY2012 CSAR1:0 (2012)  
 
Serine/threonine-protein kinase Chk1
Name:Serine/threonine-protein kinase Chk1
Type:Enzyme Catalytic Domain
Mol. Mass.:54443.02
Organism:Homo sapiens (Human)
Description:gi_166295192
Residue:476
BDBM50221567
NameBDBM50221567
Synonyms:4-(5-(6,7-dimethoxy-2,4-dihydroindeno[1,2-c]pyrazol-3-yl)pyridin-2-yl)phenol CHEMBL245802 | Chk1_144
TypeSmall organic molecule
Emp. Form.C23H19N3O3
Mol. Mass.385.4153
SMILESCOc1cc2Cc3c(n[nH]c3-c2cc1OC)-c1ccc(nc1)-c1ccc(O)cc1