Reaction Details
TargetSerine/threonine-protein kinase Chk1
LigandBDBM91838
Substrate/Competitorn/a
Meas. Tech.Abbott Kinase Enzymatics_CHK1/289 CDC25c
IC50 7±n/a nM
Citation CSARdock, CD CHK1 in CSAR_FULL_RELEASE_3JULY2012 CSAR1:0 (2012)  
 
Serine/threonine-protein kinase Chk1
Name:Serine/threonine-protein kinase Chk1
Type:Enzyme Catalytic Domain
Mol. Mass.:54443.02
Organism:Homo sapiens (Human)
Description:gi_166295192
Residue:476
BDBM91838
NameBDBM91838
Synonyms:Chk1_111
Typen/a
Emp. Form.C29H24N4O7S
Mol. Mass.572.588
SMILESCOc1cc(ccc1[N+]([O-])=O)-c1ccc2c(Nc3ccc(NC(=O)CCS(=O)(=O)c4ccccc4)cc3NC2=O)c1