Reaction Details
TargetMitogen-activated protein kinase 1
LigandBDBM92042
Substrate/Competitorn/a
Meas. Tech.Assay 1
Ki 3±n/a nM
Citation CSARdock, CD ERK2 in CSAR_FULL_RELEASE_3JULY2012 CSAR1:0 (2012)  
 
Mitogen-activated protein kinase 1
Name:Mitogen-activated protein kinase 1
Type:Ser/Thr Protein Kinase
Mol. Mass.:41392.76
Organism:Homo sapiens (Human)
Description:P28482
Residue:360
BDBM92042
NameBDBM92042
Synonyms:erk000448
Typen/a
Emp. Form.C22H27N5O2
Mol. Mass.393.4821
SMILESCC(C)CNc1ncc(C)c(n1)-c1c[nH]c(c1)C(=O)N[C@H](CO)c1ccccc1