Reaction Details
TargetMitogen-activated protein kinase 1
LigandBDBM92041
Substrate/Competitorn/a
Meas. Tech.Assay 1
Ki 2±n/a nM
Citation CSARdock, CD ERK2 in CSAR_FULL_RELEASE_3JULY2012 CSAR1:0 (2012)  
 
Mitogen-activated protein kinase 1
Name:Mitogen-activated protein kinase 1
Type:Ser/Thr Protein Kinase
Mol. Mass.:41392.76
Organism:Homo sapiens (Human)
Description:P28482
Residue:360
BDBM92041
NameBDBM92041
Synonyms:erk000447
Typen/a
Emp. Form.C25H22F3N5O3
Mol. Mass.497.4691
SMILESCc1cnc(Nc2ccc(OC(F)(F)F)cc2)nc1-c1c[nH]c(c1)C(=O)N[C@H](CO)c1ccccc1