Reaction Details
TargetMitogen-activated protein kinase 1
LigandBDBM92140
Substrate/Competitorn/a
Meas. Tech.Assay 1
Ki 2±n/a nM
Citation CSARdock, CD ERK2 in CSAR_FULL_RELEASE_3JULY2012 CSAR1:0 (2012)  
 
Mitogen-activated protein kinase 1
Name:Mitogen-activated protein kinase 1
Type:Ser/Thr Protein Kinase
Mol. Mass.:41392.76
Organism:Homo sapiens (Human)
Description:P28482
Residue:360
BDBM92140
NameBDBM92140
Synonyms:erk000586
Typen/a
Emp. Form.C26H27N5O2
Mol. Mass.441.5249
SMILESCc1ccc(Nc2ncc(C)c(n2)-c2c[nH]c(c2)C(=O)N[C@H](CO)c2cccc(C)c2)cc1