Reaction Details
TargetMitogen-activated protein kinase 1
LigandBDBM35647
Substrate/Competitorn/a
Meas. Tech.Assay 1
Ki 4±n/a nM
Citation CSARdock, CD ERK2 in CSAR_FULL_RELEASE_3JULY2012 CSAR1:0 (2012)  
 
Mitogen-activated protein kinase 1
Name:Mitogen-activated protein kinase 1
Type:Ser/Thr Protein Kinase
Mol. Mass.:41392.76
Organism:Homo sapiens (Human)
Description:P28482
Residue:360
BDBM35647
NameBDBM35647
Synonyms:erk000636 | pyrimidylpyrrole, 9f
TypeSmall organic molecule
Emp. Form.C24H23N5O3
Mol. Mass.429.4711
SMILESCc1cnc(Nc2ccccc2O)nc1-c1c[nH]c(c1)C(=O)N[C@H](CO)c1ccccc1