Reaction Details
TargetMitogen-activated protein kinase 1
LigandBDBM92208
Substrate/Competitorn/a
Meas. Tech.Assay 1
Ki 3±n/a nM
Citation CSARdock, CD ERK2 in CSAR_FULL_RELEASE_3JULY2012 CSAR1:0 (2012)  
 
Mitogen-activated protein kinase 1
Name:Mitogen-activated protein kinase 1
Type:Ser/Thr Protein Kinase
Mol. Mass.:41392.76
Organism:Homo sapiens (Human)
Description:P28482
Residue:360
BDBM92208
NameBDBM92208
Synonyms:erk000668
Typen/a
Emp. Form.C25H25ClN6O2
Mol. Mass.476.958
SMILESCc1cc(N)ccc1Nc1ncc(C)c(n1)-c1c[nH]c(c1)C(=O)N[C@H](CO)c1cccc(Cl)c1