Reaction Details
TargetMitogen-activated protein kinase 1
LigandBDBM35658
Substrate/Competitorn/a
Meas. Tech.Assay 1
Ki 5±n/a nM
Citation CSARdock, CD ERK2 in CSAR_FULL_RELEASE_3JULY2012 CSAR1:0 (2012)  
 
Mitogen-activated protein kinase 1
Name:Mitogen-activated protein kinase 1
Type:Ser/Thr Protein Kinase
Mol. Mass.:41392.76
Organism:Homo sapiens (Human)
Description:P28482
Residue:360
BDBM35658
NameBDBM35658
Synonyms:erk000651 | pyrimidylpyrrole, 11f
TypeSmall organic molecule
Emp. Form.C24H20Cl2FN5O2
Mol. Mass.500.352
SMILESCc1cnc(Nc2ccc(Cl)cc2F)nc1-c1c[nH]c(c1)C(=O)N[C@H](CO)c1cccc(Cl)c1