Reaction Details
TargetMitogen-activated protein kinase 1
LigandBDBM92130
Substrate/Competitorn/a
Meas. Tech.Assay 1
Ki 3±n/a nM
Citation CSARdock, CD ERK2 in CSAR_FULL_RELEASE_3JULY2012 CSAR1:0 (2012)  
 
Mitogen-activated protein kinase 1
Name:Mitogen-activated protein kinase 1
Type:Ser/Thr Protein Kinase
Mol. Mass.:41392.76
Organism:Homo sapiens (Human)
Description:P28482
Residue:360
BDBM92130
NameBDBM92130
Synonyms:erk000566
Typen/a
Emp. Form.C26H27N5O2
Mol. Mass.441.5249
SMILESCc1cc(C)cc(Nc2ncc(C)c(n2)-c2c[nH]c(c2)C(=O)N[C@H](CO)c2ccccc2)c1